Target
Thymidylate synthase
Ligand
BDBM50011243
Substrate
Meas. Tech.
ChEMBL_225606 (CHEMBL844163)
Ki
26±n/a nM
Citation
 Berman, EMWerbel, LM The renewed potential for folate antagonists in contemporary cancer chemotherapy. J Med Chem 34:479-85 (1991)  
Target
Name:
Thymidylate synthase
Synonyms:
TS TYMS Thymidylate synthase (TS) | Thymidylate synthase/GAR transformylase/AICAR transformylase
Type:
Enzyme
Mol. Mass.:
35718.07
Organism:
Homo sapiens (Human)
Description:
Residue:
313
  
Inhibitor
Name:
BDBM50011243
Synonyms:
2-{4-[(4-Hydroxy-quinazolin-6-ylmethyl)-prop-2-ynyl-amino]-benzoylamino}-pentanedioic acid CHEMBL171480
Type:
Small organic molecule
Emp. Form.:
C24H22N4O6
Mol. Mass.:
462.4547
SMILES:
OC(=O)CCC(NC(=O)c1ccc(cc1)N(CC#C)Cc1ccc2nc[nH]c(=O)c2c1)C(O)=O
: