Target
Non-receptor tyrosine-protein kinase TYK2
Ligand
BDBM50264841
Substrate
Meas. Tech.
ChEMBL_1699217 (CHEMBL4050199)
IC50
132000±n/a nM
Citation
 Sugimoto, YSawant, DBFisk, HAMao, LLi, CChettiar, SLi, PKDarby, MVBrueggemeier, RW Novel pyrrolopyrimidines as Mps1/TTK kinase inhibitors for breast cancer. Bioorg Med Chem 25:2156-2166 (2017)  
Target
Name:
Non-receptor tyrosine-protein kinase TYK2
Synonyms:
Non-receptor tyrosine-protein kinase TYK2 (TYK2) TYK2_HUMAN | Tyrosine-protein kinase TYK2
Type:
Protein
Mol. Mass.:
133666.03
Organism:
Homo sapiens (Human)
Description:
P29597
Residue:
1187
  
Inhibitor
Name:
BDBM50264841
Synonyms:
CHEMBL4076767
Type:
Small organic molecule
Emp. Form.:
C23H30N6O2
Mol. Mass.:
422.5233
SMILES:
COc1cc(ccc1Nc1nc(NC2CCCCC2)c2cc[nH]c2n1)N1CCOCC1
: