Target
Casein kinase II subunit alpha
Ligand
BDBM50028301
Substrate
Meas. Tech.
ChEMBL_1699297 (CHEMBL4050279)
Kd
0.500000±n/a nM
Citation
 Vahter, JViht, KUri, AEnkvist, E Oligo-aspartic acid conjugates with benzo[c][2,6]naphthyridine-8-carboxylic acid scaffold as picomolar inhibitors of CK2. Bioorg Med Chem 25:2277-2284 (2017)  
Target
Name:
Casein kinase II subunit alpha
Synonyms:
CK II CK2- alpha CSK21_HUMAN Casein kinase 2 Casein kinase II alpha/beta Casein kinase II subunit alpha (CK2A1) Casein kinase II subunit alpha (CK2a V66A) Casein kinase II subunit alpha (CK2a)
Type:
Enzyme
Mol. Mass.:
45151.12
Organism:
Homo sapiens (Human)
Description:
P68400
Residue:
391
  
Inhibitor
Name:
BDBM50028301
Synonyms:
CHEMBL4061407
Type:
Small organic molecule
Emp. Form.:
C45H58Br4N10O21
Mol. Mass.:
1394.612
SMILES:
NCCCC[C@H](NC(=O)[C@H](CC(O)=O)NC(=O)[C@H](CC(O)=O)NC(=O)[C@H](CC(O)=O)NC(=O)[C@H](CC(O)=O)NC(=O)[C@H](CC(O)=O)NC(=O)[C@H](CC(O)=O)NC(=O)CCCCCCCn1cnc2c(Br)c(Br)c(Br)c(Br)c12)C(O)=O
: