Target
Epidermal growth factor receptor
Ligand
BDBM50054654
Substrate
Meas. Tech.
ChEMBL_1699483 (CHEMBL4050465)
EC50
70±n/a nM
Citation
 Wang, ALi, XWu, HZou, FYan, XEChen, CHu, CYu, KWang, WZhao, PWu, JQi, ZWang, WWang, BWang, LRen, TZhang, SYun, CHLiu, JLiu, Q Discovery of (R)-1-(3-(4-Amino-3-(3-chloro-4-(pyridin-2-ylmethoxy)phenyl)-1H-pyrazolo[3,4-d]pyrimidin-1-yl)piperidin-1-yl)prop-2-en-1-one (CHMFL-EGFR-202) as a Novel Irreversible EGFR Mutant Kinase Inhibitor with a Distinct Binding Mode. J Med Chem 60:2944-2962 (2017)  
Target
Name:
Epidermal growth factor receptor
Synonyms:
EGF Receptor Substrate EGFR_HUMAN ERBB1 Epidermal Growth Factor Receptor erbB-1 Epidermal growth factor receptor (EGFR) HER1 Proto-oncogene c-ErbB-1 Tyrosine-Protein Kinase ErbB-1
Type:
Receptor Kinase Domain
Mol. Mass.:
134279.59
Organism:
Homo sapiens (Human)
Description:
P00533
Residue:
1210
  
Inhibitor
Name:
BDBM50054654
Synonyms:
CHEMBL4068839
Type:
Small organic molecule
Emp. Form.:
C25H24ClN7O2
Mol. Mass.:
489.957
SMILES:
Nc1ncnc2n(nc(-c3ccc(OCc4ccccn4)c(Cl)c3)c12)[C@@H]1CCCN(C1)C(=O)C=C
: