Target
Bromodomain-containing protein 4
Ligand
BDBM50265655
Substrate
Meas. Tech.
ChEMBL_1700128 (CHEMBL4051110)
Ki
1.5±n/a nM
Citation
 Wang, LPratt, JKSoltwedel, TSheppard, GSFidanze, SDLiu, DHasvold, LAMantei, RAHolms, JHMcClellan, WJWendt, MDWada, CFrey, RHansen, TMHubbard, RPark, CHLi, LMagoc, TJAlbert, DHLin, XWarder, SEKovar, PHuang, XWilcox, DWang, RRajaraman, GPetros, AMHutchins, CWPanchal, SCSun, CElmore, SWShen, YKati, WMMcDaniel, KF Fragment-Based, Structure-Enabled Discovery of Novel Pyridones and Pyridone Macrocycles as Potent Bromodomain and Extra-Terminal Domain (BET) Family Bromodomain Inhibitors. J Med Chem 60:3828-3850 (2017)  
Target
Name:
Bromodomain-containing protein 4
Synonyms:
BRD4 Bromodomain-containing protein 4 (BRD4) Protein HUNK1
Type:
Protein
Mol. Mass.:
152264.84
Organism:
Homo sapiens (Human)
Description:
O60885
Residue:
1362
  
Inhibitor
Name:
BDBM50265655
Synonyms:
CHEMBL4099010
Type:
Small organic molecule
Emp. Form.:
C24H24F2N2O5S
Mol. Mass.:
490.52
SMILES:
CCS(=O)(=O)Nc1ccc2Oc3c(F)cc(F)cc3CCCCOc3cc(=O)n(C)cc3-c2c1
: