Target
Glucocorticoid receptor
Ligand
BDBM50265807
Substrate
Meas. Tech.
ChEMBL_1700169 (CHEMBL4051151)
Ki
0.290000±n/a nM
Citation
 Hunt, HJBelanoff, JKWalters, IGourdet, BThomas, JBarton, NUnitt, JPhillips, TSwift, DEaton, E Identification of the Clinical Candidate (R)-(1-(4-Fluorophenyl)-6-((1-methyl-1H-pyrazol-4-yl)sulfonyl)-4,4a,5,6,7,8-hexahydro-1H-pyrazolo[3,4-g]isoquinolin-4a-yl)(4-(trifluoromethyl)pyridin-2-yl)methanone (CORT125134): A Selective Glucocorticoid Receptor (GR) Antagonist. J Med Chem 60:3405-3421 (2017)  
Target
Name:
Glucocorticoid receptor
Synonyms:
GCR_HUMAN GRL Glucocorticoid receptor (GRFP) Nuclear receptor subfamily 3 group C member 1
Type:
Enzyme
Mol. Mass.:
85656.87
Organism:
Homo sapiens (Human)
Description:
P04150
Residue:
777
  
Inhibitor
Name:
BDBM50265807
Synonyms:
CHEMBL4084014
Type:
Small organic molecule
Emp. Form.:
C28H22F4N4O3S2
Mol. Mass.:
602.623
SMILES:
Cc1cnc(s1)C(=O)[C@@]12CN(CCC1=Cc1c(C2)cnn1-c1ccc(F)cc1)S(=O)(=O)c1cccc(c1)C(F)(F)F
: