Target
Neurotensin receptor type 1
Ligand
BDBM50048908
Substrate
Meas. Tech.
ChEMBL_1700219 (CHEMBL4051201)
Ki
1.1±n/a nM
Citation
 Fanelli, RFloquet, NBesserer-Offroy, ÉDelort, BVivancos, MLongpré, JMRenault, PMartinez, JSarret, PCavelier, F Use of Molecular Modeling to Design Selective NTS2 Neurotensin Analogues. J Med Chem 60:3303-3313 (2017)  
Target
Name:
Neurotensin receptor type 1
Synonyms:
Dopamine receptor D2L/neurotensin receptor NTS1 NTRR Neurotensin receptor 1 | neurotensin receptor type 1
Type:
PROTEIN
Mol. Mass.:
46278.89
Organism:
Homo sapiens (Human)
Description:
ChEMBL_1453811
Residue:
418
  
Inhibitor
Name:
BDBM50048908
Synonyms:
CHEMBL415788
Type:
Small organic molecule
Emp. Form.:
C38H64N12O8
Mol. Mass.:
816.9904
SMILES:
CC[C@H](C)[C@H](NC(=O)[C@H](Cc1ccc(O)cc1)NC(=O)[C@@H]1CCCN1C(=O)[C@H](CCCNC(N)=N)NC(=O)[C@@H](N)CCCNC(N)=N)C(=O)N[C@@H](CC(C)C)C(O)=O
: