Target
Kynurenine 3-monooxygenase
Ligand
BDBM50266033
Substrate
Meas. Tech.
ChEMBL_1700449 (CHEMBL4051431)
IC50
2.5±n/a nM
Citation
 Walker, ALAncellin, NBeaufils, BBergeal, MBinnie, MBouillot, AClapham, DDenis, AHaslam, CPHolmes, DSHutchinson, JPLiddle, JMcBride, AMirguet, OMowat, CGRowland, PTiberghien, NTrottet, LUings, IWebster, SPZheng, XMole, DJ Development of a Series of Kynurenine 3-Monooxygenase Inhibitors Leading to a Clinical Candidate for the Treatment of Acute Pancreatitis. J Med Chem 60:3383-3404 (2017)  
Target
Name:
Kynurenine 3-monooxygenase
Synonyms:
KMO | KMO_HUMAN
Type:
PROTEIN
Mol. Mass.:
55831.03
Organism:
Homo sapiens (Human)
Description:
ChEMBL_1487479
Residue:
486
  
Inhibitor
Name:
BDBM50266033
Synonyms:
CHEMBL4070050
Type:
Small organic molecule
Emp. Form.:
C21H26ClN3O8
Mol. Mass.:
483.899
SMILES:
NC(CO)(CO)CO.C[C@@H](Oc1cc2oc(=O)n(CCC(O)=O)c2cc1Cl)c1ccccn1
: