Target
DNA gyrase subunit A/B
Ligand
BDBM50266349
Substrate
Meas. Tech.
ChEMBL_1700660 (CHEMBL4051642)
IC50
8.0±n/a nM
Citation
 Panchaud, PBruyère, TBlumstein, ACBur, DChambovey, AErtel, EAGude, MHubschwerlen, CJacob, LKimmerlin, TPfeifer, TPrade, LSeiler, PRitz, DRueedi, G Discovery and Optimization of Isoquinoline Ethyl Ureas as Antibacterial Agents. J Med Chem 60:3755-3775 (2017)  
Target
Name:
DNA gyrase subunit A/B
Synonyms:
DNA Gyrase
Type:
A2B2 tetramer
Mol. Mass.:
Description:
Components:
This complex has 2 components.
Component 1
Name:
DNA gyrase subunit A
Synonyms:
DNA gyrase subunit A (gyrA) gyrA
Type:
Enzyme Subunit
Mol. Mass.:
99588.82
Organism:
Staphylococcus aureus
Description:
Residue:
889
  
Component 2
Name:
DNA gyrase subunit B
Synonyms:
DNA gyrase DNA gyrase subunit B (gyrB) gyrB
Type:
Enzyme Subunit
Mol. Mass.:
72530.91
Organism:
Staphylococcus aureus
Description:
Residue:
644
  
Inhibitor
Name:
BDBM50266349
Synonyms:
CHEMBL4092234
Type:
Small organic molecule
Emp. Form.:
C26H34N6O3
Mol. Mass.:
478.5866
SMILES:
CCNC(=O)Nc1cc2c(ccc(CNC(=O)OCCNCC(C)(C)C)c2cn1)-c1ccncc1
: