Target
Melanocortin receptor 3
Ligand
BDBM50266739
Substrate
Meas. Tech.
ChEMBL_1701224 (CHEMBL4052206)
IC50
965±n/a nM
Citation
 Doering, SRFreeman, KTSchnell, SMHaslach, EMDirain, MDebevec, GGeer, PSantos, RGGiulianotti, MAPinilla, CAppel, JRSpeth, RCHoughten, RAHaskell-Luevano, C Discovery of Mixed Pharmacology Melanocortin-3 Agonists and Melanocortin-4 Receptor Tetrapeptide Antagonist Compounds (TACOs) Based on the Sequence Ac-Xaa J Med Chem 60:4342-4357 (2017)  
Target
Name:
Melanocortin receptor 3
Synonyms:
MC3-R Mc3r
Type:
PROTEIN
Mol. Mass.:
35808.24
Organism:
Mus musculus
Description:
ChEMBL_1498848
Residue:
323
  
Inhibitor
Name:
BDBM50266739
Synonyms:
CHEMBL4071063
Type:
Small organic molecule
Emp. Form.:
C34H46IN11O5S
Mol. Mass.:
847.769
SMILES:
CC(=O)N[C@@H](CCCNC(N)=N)C(=O)N[C@@H](CCCNC(N)=N)C(=O)N[C@H](Cc1ccc(I)cc1)C(=O)N[C@@H](Cc1csc2ccccc12)C(N)=O
: