Target
Melanocortin receptor 3
Ligand
BDBM50017181
Substrate
Meas. Tech.
ChEMBL_1701207 (CHEMBL4052189)
EC50
0.090000±n/a nM
Citation
 Doering, SRFreeman, KTSchnell, SMHaslach, EMDirain, MDebevec, GGeer, PSantos, RGGiulianotti, MAPinilla, CAppel, JRSpeth, RCHoughten, RAHaskell-Luevano, C Discovery of Mixed Pharmacology Melanocortin-3 Agonists and Melanocortin-4 Receptor Tetrapeptide Antagonist Compounds (TACOs) Based on the Sequence Ac-Xaa J Med Chem 60:4342-4357 (2017)  
Target
Name:
Melanocortin receptor 3
Synonyms:
MC3-R Mc3r
Type:
PROTEIN
Mol. Mass.:
35808.24
Organism:
Mus musculus
Description:
ChEMBL_1498848
Residue:
323
  
Inhibitor
Name:
BDBM50017181
Synonyms:
CHEMBL441738
Type:
Small organic molecule
Emp. Form.:
C78H111N21O19
Mol. Mass.:
1646.8452
SMILES:
CCCC[C@H](NC(=O)[C@H](CO)NC(=O)[C@H](Cc1ccc(O)cc1)NC(=O)[C@H](CO)NC(C)=O)C(=O)N[C@@H](CCC(O)=O)C(=O)N[C@@H](Cc1cnc[nH]1)C(=O)N[C@H](Cc1ccccc1)C(=O)N[C@@H](CCCNC(N)=N)C(=O)N[C@@H](Cc1c[nH]c2ccccc12)C(=O)NCC(=O)N[C@@H](CCCCN)C(=O)N1CCC[C@H]1C(=O)N[C@@H](C(C)C)C(N)=O
: