Target
Lysyl oxidase homolog 2
Ligand
BDBM50266794
Substrate
Meas. Tech.
ChEMBL_1701350 (CHEMBL4052332)
IC50
110±n/a nM
Citation
 Rowbottom, MWBain, GCalderon, ILasof, TLonergan, DLai, AHuang, FDarlington, JProdanovich, PSantini, AMKing, CDGoulet, LShannon, KEMa, GLNguyen, KMacKenna, DAEvans, JFHutchinson, JH Identification of 4-(Aminomethyl)-6-(trifluoromethyl)-2-(phenoxy)pyridine Derivatives as Potent, Selective, and Orally Efficacious Inhibitors of the Copper-Dependent Amine Oxidase, Lysyl Oxidase-Like 2 (LOXL2). J Med Chem 60:4403-4423 (2017)  
Target
Name:
Lysyl oxidase homolog 2
Synonyms:
1.4.3.13 LOXL2_HUMAN Lysyl oxidase-like protein 2 Lysyl oxidase-related protein WS9-14
Type:
PROTEIN
Mol. Mass.:
86721.38
Organism:
Homo sapiens (Human)
Description:
ChEMBL_115990
Residue:
774
  
Inhibitor
Name:
BDBM50266794
Synonyms:
CHEMBL4093765
Type:
Small organic molecule
Emp. Form.:
C22H20ClN3O2S
Mol. Mass.:
425.931
SMILES:
Cl.NCc1ccnc(Oc2cccc(c2)C(=O)NCc2cc3ccccc3s2)c1
: