Target
Mitogen-activated protein kinase kinase kinase 14
Ligand
BDBM158559
Substrate
Meas. Tech.
ChEMBL_1701709 (CHEMBL4052942)
Ki
36±n/a nM
Citation
 Castanedo, GMBlaquiere, NBeresini, MBravo, BBrightbill, HChen, JCui, HFEigenbrot, CEverett, CFeng, JGodemann, RGogol, EHymowitz, SJohnson, AKayagaki, NKohli, PBKnüppel, KKraemer, JKrüger, SLoke, PMcEwan, PMontalbetti, CRoberts, DASmith, MSteinbacher, SSujatha-Bhaskar, STakahashi, RWang, XWu, LCZhang, YStaben, ST Structure-Based Design of Tricyclic NF-?B Inducing Kinase (NIK) Inhibitors That Have High Selectivity over Phosphoinositide-3-kinase (PI3K). J Med Chem 60:627-640 (2017)  
Target
Name:
Mitogen-activated protein kinase kinase kinase 14
Synonyms:
HsNIK MAP3K14 NF-kappa-beta-inducing kinase (NF-kB) Serine/threonine-protein kinase NIK
Type:
Protein
Mol. Mass.:
104059.50
Organism:
Homo sapiens (Human)
Description:
Q99558
Residue:
947
  
Inhibitor
Name:
BDBM158559
Synonyms:
US9034866, 34
Type:
Small organic molecule
Emp. Form.:
C18H18FN3O3
Mol. Mass.:
343.3522
SMILES:
Cc1c(nc2-c3cc(C#CC(C)(C)O)c(F)cc3OCCn12)C(N)=O
: