Target
Bromodomain-containing protein 1
Ligand
BDBM50249810
Substrate
Meas. Tech.
ChEMBL_1701786 (CHEMBL4053019)
Kd
210±n/a nM
Citation
 Igoe, NBayle, EDFedorov, OTallant, CSavitsky, PRogers, COwen, DRDeb, GSomervaille, TCAndrews, DMJones, NCheasty, ARyder, HBrennan, PEMüller, SKnapp, SFish, PV Design of a Biased Potent Small Molecule Inhibitor of the Bromodomain and PHD Finger-Containing (BRPF) Proteins Suitable for Cellular and in Vivo Studies. J Med Chem 60:668-680 (2017)  
Target
Name:
Bromodomain-containing protein 1
Synonyms:
BR140-like protein BRD1_HUMAN BRL Bromodomain and PHD finger-containing protein 2 | Bromodomain-containing protein 1
Type:
PROTEIN
Mol. Mass.:
119557.65
Organism:
Homo sapiens (Human)
Description:
ChEMBL_105349
Residue:
1058
  
Inhibitor
Name:
BDBM50249810
Synonyms:
CHEMBL4102050
Type:
Small organic molecule
Emp. Form.:
C18H15N3O3S
Mol. Mass.:
353.395
SMILES:
Cc1cc2cc(NS(=O)(=O)c3ccc(cc3)C#N)ccc2n(C)c1=O
: