Target
11-beta-hydroxysteroid dehydrogenase type 2
Ligand
BDBM50233538
Substrate
Meas. Tech.
ChEMBL_1702998 (CHEMBL4054231)
IC50
1.3±n/a nM
Citation
 Shao, LDBao, YShen, YSu, JLeng, YZhao, QS Synthesis of selective 11?-HSD1 inhibitors based on dammarane scaffold. Eur J Med Chem 135:324-338 (2017)  
Target
Name:
11-beta-hydroxysteroid dehydrogenase type 2
Synonyms:
11-DH2 11-beta-Hydroxysteroid Dehydrogenase 2 (11-beta-HSD2) 11-beta-hydroxysteroid dehydrogenase 2 11-beta-hydroxysteroid dehydrogenase type 2 (11-beta-HSD2) DHI2_HUMAN HSD11K SDR9C3
Type:
Enzyme
Mol. Mass.:
44141.72
Organism:
Homo sapiens (Human)
Description:
Purified recombinant human 11beta-HSD2.
Residue:
405
  
Inhibitor
Name:
BDBM50233538
Synonyms:
18beta-glycyrrhetic acid CHEMBL230006 glycyrrhetinic acid
Type:
Small organic molecule
Emp. Form.:
C30H46O4
Mol. Mass.:
470.6838
SMILES:
CC1(C)[C@@H](O)CC[C@@]2(C)[C@H]1CC[C@]1(C)[C@@H]2C(=O)C=C2[C@@H]3C[C@](C)(CC[C@]3(C)CC[C@@]12C)C(O)=O
: