Target
Sodium channel protein type 9 subunit alpha
Ligand
BDBM154055
Substrate
Meas. Tech.
ChEMBL_1704721 (CHEMBL4055954)
IC50
4300±n/a nM
Citation
 La, DSPeterson, EABode, CBoezio, AABregman, HChu-Moyer, MYCoats, JDiMauro, EFDineen, TADu, BGao, HGraceffa, RGunaydin, HGuzman-Perez, AFremeau, RHuang, XIlch, CKornecook, TJKreiman, CLigutti, JJasmine Lin, MHMcDermott, JSMarx, IMatson, DJMcDonough, SIMoyer, BDNho Nguyen, HTaborn, KYu, VWeiss, MM The discovery of benzoxazine sulfonamide inhibitors of Na Bioorg Med Chem Lett 27:3477-3485 (2017)  
Target
Name:
Sodium channel protein type 9 subunit alpha
Synonyms:
Kiaa4197 Peripheral sodium channel 1 Scn9a Sodium channel protein type IX subunit alpha | Voltage-gated sodium channel subunit alpha Nav1.7
Type:
PROTEIN
Mol. Mass.:
225808.99
Organism:
Mus musculus
Description:
ChEMBL_109594
Residue:
1984
  
Inhibitor
Name:
BDBM154055
Synonyms:
US9012443, 48
Type:
Small organic molecule
Emp. Form.:
C26H21F3N4O2S
Mol. Mass.:
510.531
SMILES:
FC(F)(F)c1ccc(c(c1)C1=CCNCC1)-c1cccc2cc(ccc12)S(=O)(=O)Nc1ccncn1
: