Target
C5a anaphylatoxin chemotactic receptor 1
Ligand
BDBM50012293
Substrate
Meas. Tech.
ChEMBL_41594 (CHEMBL654887)
Ki
300000±n/a nM
Citation
 Kawai, MQuincy, DALane, BMollison, KWLuly, JRCarter, GW Identification and synthesis of a receptor binding site of human anaphylatoxin C5a. J Med Chem 34:2068-71 (1991)  
Target
Name:
C5a anaphylatoxin chemotactic receptor 1
Synonyms:
C5AR C5AR1_HUMAN C5a anaphylatoxin chemotactic receptor C5a-R | CD_antigen=CD88
Type:
Enzyme
Mol. Mass.:
39347.68
Organism:
Homo sapiens (Human)
Description:
P21730
Residue:
350
  
Inhibitor
Name:
BDBM50012293
Synonyms:
CHEMBL409278 | Ser-Gln-Leu-Alr-Ala-Asn-Ile-Ser-His-Lys-Asp-Met-Gln-Leu-Gly-Arg
Type:
Small organic molecule
Emp. Form.:
C76H132N28O24S
Mol. Mass.:
1854.099
SMILES:
CC[C@H](C)[C@H](NC(=O)[C@H](CC(N)=O)NC(=O)[C@H](C)NC(=O)[C@H](CCCNC(N)=N)NC(=O)[C@H](CC(C)C)NC(=O)[C@H](CCC(N)=O)NC(=O)[C@@H](N)CO)C(=O)N[C@@H](CO)C(=O)N[C@@H](Cc1cnc[nH]1)C(=O)N[C@@H](CCCCN)C(=O)N[C@@H](CC(O)=O)C(=O)N[C@@H](CCSC)C(=O)N[C@@H](CCC(N)=O)C(=O)N[C@@H](CC(C)C)C(=O)NCC(=O)N[C@@H](CCCNC(N)=N)C(O)=O
: