Target
Gastrin-releasing peptide receptor
Ligand
BDBM50012306
Substrate
Meas. Tech.
ChEMBL_206637 (CHEMBL810154)
IC50
1.8±n/a nM
Citation
 Heimbrook, DCSaari, WSBalishin, NLFisher, TWFriedman, AKiefer, DMRotberg, NSWallen, JWOliff, A Gastrin releasing peptide antagonists with improved potency and stability. J Med Chem 34:2102-7 (1991)  
Target
Name:
Gastrin-releasing peptide receptor
Synonyms:
GRP-R GRPR_MOUSE Gastrin-releasing peptide receptor | Grpr
Type:
Enzyme Catalytic Domain
Mol. Mass.:
43234.59
Organism:
MOUSE
Description:
Gastrin-Releasing peptide 0 MOUSE::P21729
Residue:
384
  
Inhibitor
Name:
BDBM50012306
Synonyms:
Ac-His-Trp-Ala-Val-Gly-His-Leu-Met-NH2 | CHEMBL274874
Type:
Small organic molecule
Emp. Form.:
C46H66N14O9S
Mol. Mass.:
991.17
SMILES:
CSCC[C@H](NC(=O)[C@H](CC(C)C)NC(=O)[C@H](Cc1cnc[nH]1)NC(=O)CNC(=O)[C@@H](NC(=O)[C@H](C)NC(=O)[C@H](Cc1c[nH]c2ccccc12)NC(=O)[C@H](Cc1cnc[nH]1)NC(C)=O)C(C)C)C(N)=O
: