Target
Gastrin-releasing peptide receptor
Ligand
BDBM50012310
Substrate
Meas. Tech.
ChEMBL_206638 (CHEMBL810155)
IC50
18±n/a nM
Citation
 Heimbrook, DCSaari, WSBalishin, NLFisher, TWFriedman, AKiefer, DMRotberg, NSWallen, JWOliff, A Gastrin releasing peptide antagonists with improved potency and stability. J Med Chem 34:2102-7 (1991)  
Target
Name:
Gastrin-releasing peptide receptor
Synonyms:
GRP-R GRPR_MOUSE Gastrin-releasing peptide receptor | Grpr
Type:
Enzyme Catalytic Domain
Mol. Mass.:
43234.59
Organism:
MOUSE
Description:
Gastrin-Releasing peptide 0 MOUSE::P21729
Residue:
384
  
Inhibitor
Name:
BDBM50012310
Synonyms:
2-{2-[2-[2-Acetylamino-3-(3H-imidazol-4-yl)-propionylamino]-3-(1H-indol-3-yl)-propionylamino]-propionylamino}-N-{[2-(3H-imidazol-4-yl)-1-(3-methyl-1-propoxymethyl-butylcarbamoyl)-ethylcarbamoyl]-methyl}-3-methyl-butyramide | CHEMBL2369384
Type:
Small organic molecule
Emp. Form.:
C44H64N12O8
Mol. Mass.:
889.0546
SMILES:
CCCOC[C@H](CC(C)C)NC(=O)[C@H](Cc1c[nH]cn1)NC(=O)CNC(=O)[C@@H](NC(=O)[C@H](C)NC(=O)[C@H](Cc1c[nH]c2ccccc12)NC(=O)[C@H](Cc1c[nH]cn1)NC(C)=O)C(C)C
: