Target
Thymidylate synthase
Ligand
BDBM18795
Substrate
Meas. Tech.
ChEBML_209810
IC50
670.0±n/a nM
Citation
 Marsham, PRJackman, ALHayter, AJDaw, MRSnowden, JLO'Connor, BMBishop, JACalvert, AHHughes, LR Quinazoline antifolate thymidylate synthase inhibitors: bridge modifications and conformationally restricted analogues in the C2-methyl series. J Med Chem 34:2209-18 (1991)  
Target
Name:
Thymidylate synthase
Synonyms:
TS TYSY_MOUSE | Tyms
Type:
PROTEIN
Mol. Mass.:
34957.15
Organism:
Mus musculus
Description:
ChEMBL_1340097
Residue:
307
  
Inhibitor
Name:
BDBM18795
Synonyms:
(2S)-2-[(5-{methyl[(2-methyl-4-oxo-1,4-dihydroquinazolin-6-yl)methyl]amino}thiophen-2-yl)formamido]pentanedioic acid RTX Tomudex | ZD1694
Type:
Small organic molecule
Emp. Form.:
C21H22N4O6S
Mol. Mass.:
458.488
SMILES:
CN(Cc1ccc2nc(C)[nH]c(=O)c2c1)c1ccc(s1)C(=O)N[C@@H](CCC(O)=O)C(O)=O
: