Target
Neuropeptide Y receptor type 2
Ligand
BDBM50269169
Substrate
Meas. Tech.
ChEMBL_1705736 (CHEMBL4056969)
EC50
0.330000±n/a nM
Citation
 Nishizawa, NNiida, AAdachi, YMasuda, YKumano, SYokoyama, KAsakawa, THirabayashi, HAmano, NTakekawa, SOhtaki, TAsami, T Potent antiobesity effect of a short-length peptide YY-analogue continuously administered in mice. Bioorg Med Chem Lett 27:3829-3832 (2017)  
Target
Name:
Neuropeptide Y receptor type 2
Synonyms:
NPY-Y2 NPY2-R NPY2R_HUMAN Y2 receptor | neuropeptide Y receptor Y2
Type:
Enzyme Catalytic Domain
Mol. Mass.:
42734.65
Organism:
Homo sapiens (Human)
Description:
NPY-Y2 NPY2R HUMAN::P49146
Residue:
381
  
Inhibitor
Name:
BDBM50269169
Synonyms:
CHEMBL4090786
Type:
Small organic molecule
Emp. Form.:
C81H142N26O20
Mol. Mass.:
1800.1564
SMILES:
CC(C)C[C@H](NC(=O)[C@H](CC(N)=O)NC(=O)[C@H](CC1CCCCC1)NC(=O)[C@H](CC1CCCCC1)NC(=O)[C@H](CO)NC(=O)[C@H](CCCNC(N)=N)NC(=O)[C@H]1CCCN1C(=O)[C@H](CO)NC(C)=O)C(=O)NC(C)(C)C(=O)N[C@@H]([C@@H](C)O)C(=O)N[C@@H](CCCNC(N)=N)C(=O)N[C@@H](CCC(N)=O)C(=O)N[C@@H](CCCNC(N)=N)C(=O)N[C@@H](CC1CCCCC1)C(N)=O
: