Target
Cytochrome P450 1A2
Ligand
BDBM50269354
Substrate
Meas. Tech.
ChEMBL_1706503 (CHEMBL4057736)
IC50
700±n/a nM
Citation
 Williams, ISJoshi, PGatchie, LSharma, MSatti, NKVishwakarma, RAChaudhuri, BBharate, SB Synthesis and biological evaluation of pyrrole-based chalcones as CYP1 enzyme inhibitors, for possible prevention of cancer and overcoming cisplatin resistance. Bioorg Med Chem Lett 27:3683-3687 (2017)  
Target
Name:
Cytochrome P450 1A2
Synonyms:
CP1A2_HUMAN CYPIA2 Cytochrome P(3)450 Cytochrome P450 1A2 (CYP1A2) Cytochrome P450-P3
Type:
Enzyme
Mol. Mass.:
58423.38
Organism:
Homo sapiens (Human)
Description:
P05177
Residue:
516
  
Inhibitor
Name:
BDBM50269354
Synonyms:
CHEMBL1335197
Type:
Small organic molecule
Emp. Form.:
C13H10ClNO
Mol. Mass.:
231.678
SMILES:
Clc1ccccc1\C=C\C(=O)c1ccc[nH]1
: