Target
Insulin receptor
Ligand
BDBM50269391
Substrate
Meas. Tech.
ChEMBL_1706543 (CHEMBL4057776)
EC50
>10000±n/a nM
Citation
 Goff, DZhang, JHeckrodt, TYu, JDing, PSingh, RHolland, SLi, WIrving, M Discovery of dual Axl/VEGF-R2 inhibitors as potential anti-angiogenic and anti-metastatic drugs for cancer chemotherapy. Bioorg Med Chem Lett 27:3766-3771 (2017)  
Target
Name:
Insulin receptor
Synonyms:
INSR INSR_HUMAN Insulin receptor beta subunit
Type:
Receptor Tyrosine Kinase
Mol. Mass.:
156322.60
Organism:
Homo sapiens (Human)
Description:
P06213
Residue:
1382
  
Inhibitor
Name:
BDBM50269391
Synonyms:
CHEMBL4059790
Type:
Small organic molecule
Emp. Form.:
C29H34ClN9O2
Mol. Mass.:
576.092
SMILES:
COc1cc2ncnc(-n3nc(Nc4ccc(N5CCN(CC5)C5CC6CCC5C6)c(Cl)c4)nc3N)c2cc1OC
: