Target
Polyunsaturated fatty acid 5-lipoxygenase
Ligand
BDBM50269585
Substrate
Meas. Tech.
ChEMBL_1706757 (CHEMBL4057990)
IC50
1020±n/a nM
Citation
 Shen, FQWang, ZCWu, SYRen, SZMan, RJWang, BZZhu, HL Synthesis of novel hybrids of pyrazole and coumarin as dual inhibitors of COX-2 and 5-LOX. Bioorg Med Chem Lett 27:3653-3660 (2017)  
Target
Name:
Polyunsaturated fatty acid 5-lipoxygenase
Synonyms:
Alox5 LOX5_RAT
Type:
PROTEIN
Mol. Mass.:
78082.31
Organism:
Rattus norvegicus
Description:
ChEMBL_1432947
Residue:
673
  
Inhibitor
Name:
BDBM50269585
Synonyms:
CHEMBL4062197
Type:
Small organic molecule
Emp. Form.:
C30H27N3O10S
Mol. Mass.:
621.614
SMILES:
COc1cc(cc(OC)c1OC)-c1cc(nn1-c1ccc(cc1)S(N)(=O)=O)C(=O)OCCOc1cc(=O)oc2ccccc12
: