Target
Chromatin remodeling regulator CECR2
Ligand
BDBM50269696
Substrate
Meas. Tech.
ChEMBL_1707032 (CHEMBL4058265)
IC50
71±n/a nM
Citation
 Crawford, TDAudia, JEBellon, SBurdick, DJBommi-Reddy, ACôté, ACummings, RTDuplessis, MFlynn, EMHewitt, MHuang, HRJayaram, HJiang, YJoshi, SKiefer, JRMurray, JNasveschuk, CGNeiss, APardo, ERomero, FASandy, PSims, RJTang, YTaylor, AMTsui, VWang, JWang, SWang, YXu, ZZawadzke, LZhu, XAlbrecht, BKMagnuson, SRCochran, AG GNE-886: A Potent and Selective Inhibitor of the Cat Eye Syndrome Chromosome Region Candidate 2 Bromodomain (CECR2). ACS Med Chem Lett 8:737-741 (2017)  
Target
Name:
Chromatin remodeling regulator CECR2
Synonyms:
CECR2 Cat eye syndrome critical region protein 2 | KIAA1740
Type:
PROTEIN
Mol. Mass.:
164223.89
Organism:
Homo sapiens (Human)
Description:
ChEMBL_107999
Residue:
1484
  
Inhibitor
Name:
BDBM50269696
Synonyms:
CHEMBL4081975
Type:
Small organic molecule
Emp. Form.:
C23H28N6O3
Mol. Mass.:
436.5068
SMILES:
COc1cc(nc(C)n1)N1CCC(CC1)N(C)C(=O)c1cn(CC=C)c(=O)c2[nH]ccc12
: