Target
CREB-binding protein
Ligand
BDBM50269846
Substrate
Meas. Tech.
ChEMBL_1707367 (CHEMBL4058600)
IC50
31±n/a nM
Citation
 Romero, FAMurray, JLai, KWTsui, VAlbrecht, BKAn, LBeresini, MHde Leon Boenig, GBronner, SMChan, EWChen, KXChen, ZChoo, EFClagg, KClark, KCrawford, TDCyr, Pde Almeida Nagata, DGascoigne, KEGrogan, JLHatzivassiliou, GHuang, WHunsaker, TLKaufman, SKoenig, SGLi, RLi, YLiang, XLiao, JLiu, WLy, JMaher, JMasui, CMerchant, MRan, YTaylor, AMWai, JWang, FWei, XYu, DZhu, BYZhu, XMagnuson, S GNE-781, A Highly Advanced Potent and Selective Bromodomain Inhibitor of Cyclic Adenosine Monophosphate Response Element Binding Protein, Binding Protein (CBP). J Med Chem 60:9162-9183 (2017)  
Target
Name:
CREB-binding protein
Synonyms:
CBP CREB-binding protein (CBP) CREBBP
Type:
Transcription Coactivator
Mol. Mass.:
265411.66
Organism:
Homo sapiens (Human)
Description:
Q92793
Residue:
2442
  
Inhibitor
Name:
BDBM50269846
Synonyms:
CHEMBL4080528
Type:
Small organic molecule
Emp. Form.:
C28H35F2N7O2
Mol. Mass.:
539.62
SMILES:
CCNC(=O)N1CCc2c(C1)c(nn2C1CCOCC1)N1CCCc2cc(-c3cnn(C)c3)c(cc12)C(F)F
: