Target
Chromatin remodeling regulator CECR2
Ligand
BDBM50269849
Substrate
Meas. Tech.
ChEMBL_1707379 (CHEMBL4058612)
IC50
14000±n/a nM
Citation
 Romero, FAMurray, JLai, KWTsui, VAlbrecht, BKAn, LBeresini, MHde Leon Boenig, GBronner, SMChan, EWChen, KXChen, ZChoo, EFClagg, KClark, KCrawford, TDCyr, Pde Almeida Nagata, DGascoigne, KEGrogan, JLHatzivassiliou, GHuang, WHunsaker, TLKaufman, SKoenig, SGLi, RLi, YLiang, XLiao, JLiu, WLy, JMaher, JMasui, CMerchant, MRan, YTaylor, AMWai, JWang, FWei, XYu, DZhu, BYZhu, XMagnuson, S GNE-781, A Highly Advanced Potent and Selective Bromodomain Inhibitor of Cyclic Adenosine Monophosphate Response Element Binding Protein, Binding Protein (CBP). J Med Chem 60:9162-9183 (2017)  
Target
Name:
Chromatin remodeling regulator CECR2
Synonyms:
CECR2 Cat eye syndrome critical region protein 2 | KIAA1740
Type:
PROTEIN
Mol. Mass.:
164223.89
Organism:
Homo sapiens (Human)
Description:
ChEMBL_107999
Residue:
1484
  
Inhibitor
Name:
BDBM50269849
Synonyms:
CHEMBL4076748
Type:
Small organic molecule
Emp. Form.:
C27H32F2N6O2
Mol. Mass.:
510.5788
SMILES:
CC(=O)N1CCc2c(C1)c(nn2C1CCOCC1)N1CCCc2cc(-c3cnn(C)c3)c(cc12)C(F)F
: