Target
Protease
Ligand
BDBM50270608
Substrate
Meas. Tech.
ChEMBL_1709400 (CHEMBL4119449)
IC50
18±n/a nM
Citation
 Bai, XYang, ZZhu, MDong, BZhou, LZhang, GWang, JWang, Y Design and synthesis of potent HIV-1 protease inhibitors with (S)-tetrahydrofuran-tertiary amine-acetamide as P2-ligand: Structure-activity studies and biological evaluation. Eur J Med Chem 137:30-44 (2017)  
Target
Name:
Protease
Synonyms:
Type:
Enzyme
Mol. Mass.:
10904.79
Organism:
Human immunodeficiency virus 1 (HIV-1)
Description:
Q9YQ12
Residue:
99
  
Inhibitor
Name:
BDBM50270608
Synonyms:
CHEMBL4129695
Type:
Small organic molecule
Emp. Form.:
C29H42N4O8S
Mol. Mass.:
606.731
SMILES:
COCCN(CC(=O)N[C@@H](Cc1ccccc1)[C@H](O)CN(CC(C)C)S(=O)(=O)c1ccc(cc1)[N+]([O-])=O)[C@H]1CCOC1
: