Target
Mitogen-activated protein kinase kinase kinase 12
Ligand
BDBM50271209
Substrate
Meas. Tech.
ChEMBL_1709819 (CHEMBL4119868)
IC50
829±n/a nM
Citation
 Patel, SMeilandt, WJErickson, RIChen, JDeshmukh, GEstrada, AAFuji, RNGibbons, PGustafson, AHarris, SFImperio, JLiu, WLiu, XLiu, YLyssikatos, JPMa, CYin, JLewcock, JWSiu, M Selective Inhibitors of Dual Leucine Zipper Kinase (DLK, MAP3K12) with Activity in a Model of Alzheimer's Disease. J Med Chem 60:8083-8102 (2017)  
Target
Name:
Mitogen-activated protein kinase kinase kinase 12
Synonyms:
DLK Leucine-zipper protein kinase MAP3K12 MUK Mixed lineage kinase | ZPK
Type:
PROTEIN
Mol. Mass.:
93216.56
Organism:
Homo sapiens (Human)
Description:
ChEMBL_1460553
Residue:
859
  
Inhibitor
Name:
BDBM50271209
Synonyms:
CHEMBL4127238
Type:
Small organic molecule
Emp. Form.:
C21H26F3N5O2
Mol. Mass.:
437.4586
SMILES:
[H][C@@]12CN(C[C@]1([H])[C@H]2c1cc(nn1CC(C)(C)O)-c1cnc(N)c(c1)C(F)(F)F)C1COC1
: