Target
Nuclear receptor ROR-gamma
Ligand
BDBM392076
Substrate
Meas. Tech.
ChEMBL_1711298 (CHEMBL4121347)
Kd
0.120000±n/a nM
Citation
 Gege, CCummings, MDAlbers, MKinzel, OKleymann, GSchlüter, TSteeneck, CNelen, MIMilligan, CSpurlino, JXue, XLeonard, KEdwards, JPFourie, AGoldberg, SDHoffmann, T Identification and biological evaluation of thiazole-based inverse agonists of ROR?t. Bioorg Med Chem Lett 28:1446-1455 (2018)  
Target
Name:
Nuclear receptor ROR-gamma
Synonyms:
NR1F3 Nuclear receptor ROR-gamma (RORC) RAR-related orphan receptor C (RORc) RORG RZRG Retinoid-related orphan receptor-gamma (RORc)
Type:
Enzyme Catalytic Domain
Mol. Mass.:
58218.40
Organism:
Homo sapiens (Human)
Description:
P51449
Residue:
518
  
Inhibitor
Name:
BDBM392076
Synonyms:
US10301272, Example 7/9
Type:
Small organic molecule
Emp. Form.:
C30H37N3O5S2
Mol. Mass.:
583.762
SMILES:
CC(C)(C)NS(=O)(=O)c1ccc(-c2sc(nc2CC2CCCCC2)C(=O)N[C@H]2C[C@@H](C2)C(O)=O)c2ccccc12
: