Target
Adenosine receptor A3
Ligand
BDBM392076
Substrate
Meas. Tech.
ChEBML_1711418
IC50
0.170000±n/a nM
Citation
 Gege, CCummings, MDAlbers, MKinzel, OKleymann, GSchlüter, TSteeneck, CNelen, MIMilligan, CSpurlino, JXue, XLeonard, KEdwards, JPFourie, AGoldberg, SDHoffmann, T Identification and biological evaluation of thiazole-based inverse agonists of ROR?t. Bioorg Med Chem Lett 28:1446-1455 (2018)  
Target
Name:
Adenosine receptor A3
Synonyms:
A3 adenosine receptor (hA3) ADORA3 | Adenosine A3 receptor (A3AR)
Type:
G Protein-Coupled Receptor (GPCR)
Mol. Mass.:
36197.32
Organism:
Homo sapiens (Human)
Description:
P0DMS8
Residue:
318
  
Inhibitor
Name:
BDBM392076
Synonyms:
US10301272, Example 7/9
Type:
Small organic molecule
Emp. Form.:
C30H37N3O5S2
Mol. Mass.:
583.762
SMILES:
CC(C)(C)NS(=O)(=O)c1ccc(-c2sc(nc2CC2CCCCC2)C(=O)N[C@H]2C[C@@H](C2)C(O)=O)c2ccccc12
: