Target
5-hydroxytryptamine receptor 1B
Ligand
BDBM392076
Substrate
Meas. Tech.
ChEBML_1711450
IC50
14±n/a nM
Citation
 Gege, CCummings, MDAlbers, MKinzel, OKleymann, GSchlüter, TSteeneck, CNelen, MIMilligan, CSpurlino, JXue, XLeonard, KEdwards, JPFourie, AGoldberg, SDHoffmann, T Identification and biological evaluation of thiazole-based inverse agonists of ROR?t. Bioorg Med Chem Lett 28:1446-1455 (2018)  
Target
Name:
5-hydroxytryptamine receptor 1B
Synonyms:
5-HT-1B 5-hydroxytryptamine receptor 1B (5HT1B) 5ht1b Serotonin 1 (5-HT1) receptor Serotonin receptor 1B
Type:
Protein
Mol. Mass.:
43173.33
Organism:
Rattus norvegicus (Rat)
Description:
P28564
Residue:
386
  
Inhibitor
Name:
BDBM392076
Synonyms:
US10301272, Example 7/9
Type:
Small organic molecule
Emp. Form.:
C30H37N3O5S2
Mol. Mass.:
583.762
SMILES:
CC(C)(C)NS(=O)(=O)c1ccc(-c2sc(nc2CC2CCCCC2)C(=O)N[C@H]2C[C@@H](C2)C(O)=O)c2ccccc12
: