Target
G-protein coupled bile acid receptor 1
Ligand
BDBM50271985
Substrate
Meas. Tech.
ChEMBL_1711749 (CHEMBL4121798)
EC50
14±n/a nM
Citation
 Agarwal, SSasane, SKumar, JDeshmukh, PBhayani, HGiri, PGiri, SSoman, SKulkarni, NJain, M Evaluation of novel TGR5 agonist in combination with Sitagliptin for possible treatment of type 2 diabetes. Bioorg Med Chem Lett 28:1849-1852 (2018)  
Target
Name:
G-protein coupled bile acid receptor 1
Synonyms:
BG37 GPBAR_HUMAN TGR5 hGPCR19
Type:
G Protein-Coupled Receptor (GPCR)
Mol. Mass.:
35260.02
Organism:
Homo sapiens (Human)
Description:
CHO cells transiently transfected with hTGR5.
Residue:
330
  
Inhibitor
Name:
BDBM50271985
Synonyms:
CHEMBL4126485
Type:
Small organic molecule
Emp. Form.:
C29H29F3N2O3S
Mol. Mass.:
542.612
SMILES:
COc1ccc(cc1OC)C(C)(C)c1cnc(SCCOCc2c(F)cccc2F)n1-c1ccc(F)cc1
: