Target
Acid-sensing ion channel 1
Ligand
BDBM16173
Substrate
Meas. Tech.
ChEMBL_1712175 (CHEMBL4122224)
IC50
30200±n/a nM
Citation
 Zhou, HWang, ZSLiu, XHChen, FH Novel amidrazone derivatives: Design, synthesis and activity evaluation. Bioorg Med Chem 26:3158-3165 (2018)  
Target
Name:
Acid-sensing ion channel 1
Synonyms:
ASIC1_RAT Acid-sensing ion channel 1 Asic1 Brain sodium channel 2
Type:
PROTEIN
Mol. Mass.:
59630.33
Organism:
Rattus norvegicus
Description:
ChEMBL_109766
Residue:
526
  
Inhibitor
Name:
BDBM16173
Synonyms:
3,5-diamino-6-chloro-N-(diaminomethylene)pyrazinamide;hydrochloride Amiloride CHEMBL945
Type:
Small organic molecule
Emp. Form.:
C6H8ClN7O
Mol. Mass.:
229.627
SMILES:
NC(=N)NC(=O)c1nc(Cl)c(N)nc1N
: