Target
Serine protease hepsin
Ligand
BDBM50272184
Substrate
Meas. Tech.
ChEMBL_1712213 (CHEMBL4122262)
IC50
100±n/a nM
Citation
 Pant, SMMukonoweshuro, ADesai, BRamjee, MKSelway, CNTarver, GJWright, AGBirchall, KChapman, TMTervonen, TAKlefström, J Design, Synthesis, and Testing of Potent, Selective Hepsin Inhibitors via Application of an Automated Closed-Loop Optimization Platform. J Med Chem 61:4335-4347 (2018)  
Target
Name:
Serine protease hepsin
Synonyms:
HEPS_HUMAN Hepsin TMPRSS1 Transmembrane protease, serine 1
Type:
Enzyme
Mol. Mass.:
45016.98
Organism:
Homo sapiens (Human)
Description:
Human deglycosylated hepsin was expressed in Pichia pastoris.
Residue:
417
  
Inhibitor
Name:
BDBM50272184
Synonyms:
CHEMBL4126579
Type:
Small organic molecule
Emp. Form.:
C21H25ClN4O3S
Mol. Mass.:
448.966
SMILES:
NC(=N)c1ccc(NC(=O)[C@H](NS(=O)(=O)c2ccc(Cl)cc2)C2CCCCC2)cc1
: