Target
Extracellular calcium-sensing receptor
Ligand
BDBM50272596
Substrate
Meas. Tech.
ChEMBL_1712580 (CHEMBL4122629)
EC50
17±n/a nM
Citation
 Miyazaki, HIkeda, YSakurai, OMiyake, TTsubota, ROkabe, JKuroda, MHisada, YYanagida, TYoneda, HTsukumo, YTokunaga, SKawata, TOhashi, RFukuda, HKojima, KKannami, AKifuji, TSato, NIdei, AIguchi, TSakairi, TMoritani, Y Discovery of evocalcet, a next-generation calcium-sensing receptor agonist for the treatment of hyperparathyroidism. Bioorg Med Chem Lett 28:2055-2060 (2018)  
Target
Name:
Extracellular calcium-sensing receptor
Synonyms:
CASR CaR Calcium-sensing receptor (CaSR) GPRC2A Parathyroid Cell calcium-sensing receptor Synonyms=GPRC2A | hCasR
Type:
Protein
Mol. Mass.:
120663.13
Organism:
Homo sapiens (Human)
Description:
P41180
Residue:
1078
  
Inhibitor
Name:
BDBM50272596
Synonyms:
CHEMBL4126450
Type:
Small organic molecule
Emp. Form.:
C23H25ClN6
Mol. Mass.:
420.938
SMILES:
Cl.C[C@@H](N[C@H]1CCN(C1)c1ccc(cc1)-c1nn[nH]n1)c1cccc2ccccc12
: