Target
Lysine-specific demethylase 7A
Ligand
BDBM50273474
Substrate
Meas. Tech.
ChEBML_1712930
IC50
76000±n/a nM
Citation
 Bhushan, BErdmann, AZhang, YBelle, RJohannson, COppermann, UHopkinson, RJSchofield, CJKawamura, A Investigations on small molecule inhibitors targeting the histone H3K4 tri-methyllysine binding PHD-finger of JmjC histone demethylases. Bioorg Med Chem 26:2984-2991 (2018)  
Target
Name:
Lysine-specific demethylase 7A
Synonyms:
JHDM1D KDM7 KDM7A_HUMAN Lysine-specific demethylase 7 | Lysine-specific demethylase 7A/7B
Type:
PROTEIN
Mol. Mass.:
106577.86
Organism:
Homo sapiens (Human)
Description:
ChEMBL_859443
Residue:
941
  
Inhibitor
Name:
BDBM50273474
Synonyms:
CHEMBL4129980
Type:
Small organic molecule
Emp. Form.:
C27H36INO5
Mol. Mass.:
581.4829
SMILES:
[I-].CCCCc1oc2ccccc2c1C(=O)c1cc(OC)c(OCCC[N+](C)(C)C)c(OC)c1
: