Target
Lysine-specific demethylase 7A
Ligand
BDBM50273471
Substrate
Meas. Tech.
ChEMBL_1712926 (CHEMBL4122975)
IC50
151000±n/a nM
Citation
 Bhushan, BErdmann, AZhang, YBelle, RJohannson, COppermann, UHopkinson, RJSchofield, CJKawamura, A Investigations on small molecule inhibitors targeting the histone H3K4 tri-methyllysine binding PHD-finger of JmjC histone demethylases. Bioorg Med Chem 26:2984-2991 (2018)  
Target
Name:
Lysine-specific demethylase 7A
Synonyms:
JHDM1D KDM7 KDM7A_HUMAN Lysine-specific demethylase 7 | Lysine-specific demethylase 7A/7B
Type:
PROTEIN
Mol. Mass.:
106577.86
Organism:
Homo sapiens (Human)
Description:
ChEMBL_859443
Residue:
941
  
Inhibitor
Name:
BDBM50273471
Synonyms:
CHEMBL4127515
Type:
Small organic molecule
Emp. Form.:
C28H38INO3
Mol. Mass.:
563.5107
SMILES:
[I-].CCCCc1oc2ccccc2c1C(=O)c1ccc(OCCC[N+](CC)(CC)CC)cc1
: