Target
Mu-type opioid receptor
Ligand
BDBM50013945
Substrate
Meas. Tech.
ChEBML_148837
Ki
0.150000±n/a nM
Citation
 Lalinde, NMoliterni, JWright, DSpencer, HKOssipov, MHSpaulding, TCRudo, FG Synthesis and pharmacological evaluation of a series of new 3-methyl-1,4-disubstituted-piperidine analgesics. J Med Chem 33:2876-82 (1990)  
Target
Name:
Mu-type opioid receptor
Synonyms:
MOR-1 Mu-type opioid receptor (MOR) OPRM_RAT Opioid receptor B Ror-b
Type:
G Protein-Coupled Receptor (GPCR)
Mol. Mass.:
44503.11
Organism:
Rattus norvegicus (rat)
Description:
Competition binding assays were carried out using membrane preparations from transfected HN9.10 cells that constitutively expressed the mu opioid receptor.
Residue:
398
  
Inhibitor
Name:
BDBM50013945
Synonyms:
CHEMBL431047 | Furan-2-carboxylic acid [3-methyl-1-(2-thiophen-2-yl-ethyl)-piperidin-4-yl]-phenyl-amide
Type:
Small organic molecule
Emp. Form.:
C23H26N2O2S
Mol. Mass.:
394.53
SMILES:
CC1CN(CCc2cccs2)CCC1N(C(=O)c1ccco1)c1ccccc1
: