Target
Prostaglandin G/H synthase 1/2
Ligand
BDBM50014199
Substrate
Meas. Tech.
ChEMBL_158283 (CHEMBL764933)
IC50
>50000±n/a nM
Citation
 Malleron, JLRoussel, GGueremy, GPonsinet, GRobin, JLTerlain, BTissieres, JM Penta- and hexadienoic acid derivatives: a novel series of 5-lipoxygenase inhibitors. J Med Chem 33:2744-9 (1990)  
Target
Name:
Prostaglandin G/H synthase 1/2
Synonyms:
Cyclooxygenase
Type:
Mol. Mass.:
Description:
ASSAY_ID of ChEMBL is 1666355
Components:
This complex has 2 components.
Component 1
Name:
Prostaglandin G/H synthase 2
Synonyms:
Cox-2 Cyclooxygenase Ptgs2
Type:
Enzyme Catalytic Domain
Mol. Mass.:
69173.51
Organism:
RAT
Description:
COX-2 0 RAT::P35355
Residue:
604
  
Component 2
Name:
Prostaglandin G/H synthase 1
Synonyms:
Cox-1 Cyclooxygenase PGH1_RAT Ptgs1
Type:
Enzyme Catalytic Domain
Mol. Mass.:
69033.56
Organism:
RAT
Description:
COX-1 0 RAT::Q63921
Residue:
602
  
Inhibitor
Name:
BDBM50014199
Synonyms:
6-Oxo-5-phenylsulfanyl-6H-pyran-2-carboxylic acid ethyl ester | CHEMBL413482
Type:
Small organic molecule
Emp. Form.:
C14H12O4S
Mol. Mass.:
276.308
SMILES:
CCOC(=O)c1ccc(Sc2ccccc2)c(=O)o1
: