Target
Polyunsaturated fatty acid 5-lipoxygenase
Ligand
BDBM50000540
Substrate
Meas. Tech.
ChEMBL_3956 (CHEMBL618054)
IC50
13000±n/a nM
Citation
 Malleron, JLRoussel, GGueremy, GPonsinet, GRobin, JLTerlain, BTissieres, JM Penta- and hexadienoic acid derivatives: a novel series of 5-lipoxygenase inhibitors. J Med Chem 33:2744-9 (1990)  
Target
Name:
Polyunsaturated fatty acid 5-lipoxygenase
Synonyms:
Alox5 LOX5_RAT
Type:
PROTEIN
Mol. Mass.:
78082.31
Organism:
Rattus norvegicus
Description:
ChEMBL_1432947
Residue:
673
  
Inhibitor
Name:
BDBM50000540
Synonyms:
1-(3-Trifluoromethyl-phenyl)-4,5-dihydro-1H-pyrazol-3-ylamine 1-(3-Trifluoromethyl-phenyl)-4,5-dihydro-1H-pyrazol-3-ylamine(BW 755 C) 1-(3-trifluoromethylphenyl)-4,5-dihydro-1H-3-pyrazolamine CHEMBL274642
Type:
Small organic molecule
Emp. Form.:
C10H10F3N3
Mol. Mass.:
229.2017
SMILES:
NC1=NN(CC1)c1cccc(c1)C(F)(F)F
: