Target
Polyunsaturated fatty acid 5-lipoxygenase
Ligand
BDBM50014201
Substrate
Meas. Tech.
ChEBML_3956
IC50
>50000±n/a nM
Citation
 Malleron, JLRoussel, GGueremy, GPonsinet, GRobin, JLTerlain, BTissieres, JM Penta- and hexadienoic acid derivatives: a novel series of 5-lipoxygenase inhibitors. J Med Chem 33:2744-9 (1990)  
Target
Name:
Polyunsaturated fatty acid 5-lipoxygenase
Synonyms:
Alox5 LOX5_RAT
Type:
PROTEIN
Mol. Mass.:
78082.31
Organism:
Rattus norvegicus
Description:
ChEMBL_1432947
Residue:
673
  
Inhibitor
Name:
BDBM50014201
Synonyms:
2-Dimethylamino-5-methylsulfanyl-6-oxo-6-phenyl-hexa-2,4-dienoic acid ethyl ester | CHEMBL432054
Type:
Small organic molecule
Emp. Form.:
C17H21NO3S
Mol. Mass.:
319.419
SMILES:
CCOC(=O)C(=CC=C(SC)C(=O)c1ccccc1)N(C)C
: