Target
Proteasome subunit beta type-10
Ligand
BDBM50274036
Substrate
Meas. Tech.
ChEMBL_1713675 (CHEMBL4123724)
IC50
130±n/a nM
Citation
 Artschwager, RWard, DJGannon, SBrouwer, AJvan de Langemheen, HKowalski, HLiskamp, RMJ Potent and Highly Selective Inhibitors of the Proteasome Trypsin-like Site by Incorporation of Basic Side Chain Containing Amino Acid Derived Sulfonyl Fluorides. J Med Chem 61:5395-5411 (2018)  
Target
Name:
Proteasome subunit beta type-10
Synonyms:
LMP10 MECL1 Multicatalytic endopeptidase complex subunit MECl-1 PSMB10 Proteasome subunit beta-2i
Type:
PROTEIN
Mol. Mass.:
28940.51
Organism:
Homo sapiens (Human)
Description:
ChEMBL_106197
Residue:
273
  
Inhibitor
Name:
BDBM50274036
Synonyms:
CHEMBL4128478
Type:
Small organic molecule
Emp. Form.:
C31H44FN7O5S
Mol. Mass.:
645.788
SMILES:
CC(C)C[C@H](NC(=O)[C@H](CC(C)C)NC(=O)[C@H](Cc1ccccc1)N=[N+]=[N-])C(=O)N[C@@H](Cc1ccc(CN)cc1)CS(F)(=O)=O
: