Target
Alpha-1B adrenergic receptor
Ligand
BDBM50274060
Substrate
Meas. Tech.
ChEMBL_1713734 (CHEMBL4123783)
Ki
0.912011±n/a nM
Citation
 Sagratini, GBuccioni, MMarucci, GPoggesi, ESkorski, MCostanzi, SGiardinà, D Chiral analogues of (+)-cyclazosin as potent? Bioorg Med Chem 26:3502-3513 (2018)  
Target
Name:
Alpha-1B adrenergic receptor
Synonyms:
ADA1B_HUMAN Adrenergic alpha1B Adrenergic receptor alpha Alpha 1B-adrenoreceptor | Alpha-1B adrenergic receptor
Type:
Enzyme
Mol. Mass.:
56862.13
Organism:
Homo sapiens (Human)
Description:
P35368
Residue:
520
  
Inhibitor
Name:
BDBM50274060
Synonyms:
CHEMBL4127078
Type:
Small organic molecule
Emp. Form.:
C24H35N5O3
Mol. Mass.:
441.5664
SMILES:
[H][C@]12CCCC[C@@]1([H])N(CCN2C(=O)CCCCC)c1nc(N)c2cc(OC)c(OC)cc2n1
: