Target
Pancreatic alpha-amylase
Ligand
BDBM50182487
Substrate
Meas. Tech.
ChEMBL_1713756 (CHEMBL4123805)
IC50
19070±n/a nM
Citation
 Prabha, BNeethu, SKrishnan, SLSherin, DRMadhukrishnan, MAnanthakrishnan, RRameshkumar, KBManojkumar, TKJayamurthy, PRadhakrishnan, KV Antidiabetic potential of phytochemicals isolated from the stem bark of Myristica fatua Houtt. var. magnifica (Bedd.) Sinclair. Bioorg Med Chem 26:3461-3467 (2018)  
Target
Name:
Pancreatic alpha-amylase
Synonyms:
1,4-alpha-D-glucan glucanohydrolase AMYP_PIG Pancreatic α-amylase
Type:
Protein
Mol. Mass.:
57088.07
Organism:
Sus scrofa (Pig)
Description:
P00690
Residue:
511
  
Inhibitor
Name:
BDBM50182487
Synonyms:
Malabaricone A
Type:
Small organic molecule
Emp. Form.:
C21H26O3
Mol. Mass.:
326.4293
SMILES:
Oc1cccc(O)c1C(=O)CCCCCCCCc1ccccc1
: