Target
Mu-type opioid receptor
Ligand
BDBM21015
Substrate
Meas. Tech.
ChEMBL_1714220 (CHEMBL4124269)
EC50
0.260000±n/a nM
Citation
 Willemse, TEiselt, EHollanders, KSchepens, Wvan Vlijmen, HWTChung, NNBlais, VHolleran, BLongpré, JMSchiller, PWMaes, BUWSarret, PGendron, LBallet, S Chemical space screening around Phe Bioorg Med Chem Lett 28:2320-2323 (2018)  
Target
Name:
Mu-type opioid receptor
Synonyms:
MOR-1 Mu-type opioid receptor (MOR) OPRM_RAT Opioid receptor B Ror-b
Type:
G Protein-Coupled Receptor (GPCR)
Mol. Mass.:
44503.11
Organism:
Rattus norvegicus (rat)
Description:
Competition binding assays were carried out using membrane preparations from transfected HN9.10 cells that constitutively expressed the mu opioid receptor.
Residue:
398
  
Inhibitor
Name:
BDBM21015
Synonyms:
(2S)-2-{2-[(2R)-2-[(2S)-2-amino-3-(4-hydroxyphenyl)propanamido]propanamido]-N-methylacetamido}-N-(2-hydroxyethyl)-3-phenylpropanamide CHEMBL38874 DAMGO US11492374, ID 2 [tyrosyl-3,5-3H(N)]-D-Ala2-Mephe4-glyol5-enkephalin
Type:
Analgesics
Emp. Form.:
C26H35N5O6
Mol. Mass.:
513.586
SMILES:
C[C@@H](NC(=O)[C@@H](N)Cc1ccc(O)cc1)C(=O)NCC(=O)N(C)[C@@H](Cc1ccccc1)C(=O)NCCO
: