Target
Delta-type opioid receptor
Ligand
BDBM50275107
Substrate
Meas. Tech.
ChEMBL_1714461 (CHEMBL4124510)
Ki
0.460000±n/a nM
Citation
 Remesic, MMacedonio, GMollica, APorreca, FHruby, VLee, YS Cyclic biphalin analogues with a novel linker lead to potent agonist activities at mu, delta, and kappa opioid receptors. Bioorg Med Chem 26:3664-3667 (2018)  
Target
Name:
Delta-type opioid receptor
Synonyms:
D-OR-1 Delta opioid receptor OPIATE Delta OPRD1 OPRK1 | opioid receptor, delta 1
Type:
G Protein-Coupled Receptor (GPCR)
Mol. Mass.:
40382.98
Organism:
Homo sapiens (Human)
Description:
Competition binding assays were carried out using membrane preparations from transfected HN9.10 cells that constitutively expressed the delta opioid receptor.
Residue:
372
  
Inhibitor
Name:
BDBM50275107
Synonyms:
CHEMBL4130303
Type:
Small organic molecule
Emp. Form.:
C54H70N10O10S4
Mol. Mass.:
1147.455
SMILES:
Cc1cc(O)cc(C)c1C[C@H](N)C(=O)N[C@@H]1CSSC[C@@H](NC(=O)[C@@H](N)Cc2c(C)cc(O)cc2C)C(=O)NCC(=O)N[C@@H](Cc2ccccc2)C(=O)NCCSSCCNC(=O)[C@H](Cc2ccccc2)NC(=O)CNC1=O
: