Target
Cholinesterase
Ligand
BDBM50275253
Substrate
Meas. Tech.
ChEMBL_1714534 (CHEMBL4124583)
IC50
2500±n/a nM
Citation
 Mostofi, MMohammadi Ziarani, GLashgari, N Design, synthesis and biological evaluation of benzofuran appended benzothiazepine derivatives as inhibitors of butyrylcholinesterase and antimicrobial agents. Bioorg Med Chem 26:3076-3095 (2018)  
Target
Name:
Cholinesterase
Synonyms:
BCHE CHLE_HORSE | Cholinesterase
Type:
Enzyme
Mol. Mass.:
65643.35
Organism:
Equus caballus (Horse)
Description:
P81908
Residue:
574
  
Inhibitor
Name:
BDBM50275253
Synonyms:
CHEMBL4130033
Type:
Small organic molecule
Emp. Form.:
C24H19NO2S
Mol. Mass.:
385.478
SMILES:
COc1cccc2cc(oc12)C1=Nc2ccccc2SC(C1)c1ccccc1
: