Target
Cholinesterase
Ligand
BDBM50275268
Substrate
Meas. Tech.
ChEMBL_1714534 (CHEMBL4124583)
IC50
6500±n/a nM
Citation
 Mostofi, MMohammadi Ziarani, GLashgari, N Design, synthesis and biological evaluation of benzofuran appended benzothiazepine derivatives as inhibitors of butyrylcholinesterase and antimicrobial agents. Bioorg Med Chem 26:3076-3095 (2018)  
Target
Name:
Cholinesterase
Synonyms:
BCHE CHLE_HORSE | Cholinesterase
Type:
Enzyme
Mol. Mass.:
65643.35
Organism:
Equus caballus (Horse)
Description:
P81908
Residue:
574
  
Inhibitor
Name:
BDBM50275268
Synonyms:
CHEMBL4129645
Type:
Small organic molecule
Emp. Form.:
C23H16BrNO2S
Mol. Mass.:
450.348
SMILES:
Oc1ccc(cc1)C1CC(=Nc2ccccc2S1)c1cc2cc(Br)ccc2o1
: