Target
Protease
Ligand
BDBM50088504
Substrate
Meas. Tech.
ChEMBL_1715482 (CHEMBL4125531)
EC50
150±n/a nM
Citation
 Qiao, JZhao, CLiu, JDu, Y Design and synthesis of selenazole-substituted ritonavir analogs. Bioorg Med Chem Lett 28:2379-2381 (2018)  
Target
Name:
Protease
Synonyms:
Type:
Enzyme
Mol. Mass.:
10904.79
Organism:
Human immunodeficiency virus 1 (HIV-1)
Description:
Q9YQ12
Residue:
99
  
Inhibitor
Name:
BDBM50088504
Synonyms:
A-84538 CHEBI:45409 Ritonavir
Type:
Small organic molecule
Emp. Form.:
C37H48N6O5S2
Mol. Mass.:
720.944
SMILES:
CC(C)[C@H](NC(=O)N(C)Cc1csc(n1)C(C)C)C(=O)N[C@H](C[C@H](O)[C@H](Cc1ccccc1)NC(=O)OCc1cncs1)Cc1ccccc1
: